BDBM50419173 CHEMBL1829146
SMILES Cc1cccc(n1)C#Cc1ccc(CCC(O)=O)cc1
InChI Key InChIKey=AVAPGBWGSJATFN-UHFFFAOYSA-N
Data  1 EC50
  Tab Delimited (TSV)   2D SDfile   Computed 3D by Vconf -m prep SDfile
Find this compound or compounds like it in BindingDB:
Activity Spreadsheet -- Enzyme Inhibition Constant Data from BindingDB
Found 1 hit for monomerid = 50419173
TargetFree fatty acid receptor 1(Homo sapiens (Human))
University Of Southern Denmark
Curated by ChEMBL
LigandPNGBDBM50419173(CHEMBL1829146)
Affinity DataEC50:  6.17E+3nM. Assay description: Agonist activity at human FFA1 receptor expressed in human 1321N1 cells assessed as calcium mobilization by fluorescence spectrophotometry
In DepthDetails ArticlePubMed