BDBM50419228 CHEMBL1835879
SMILES COc1ccc(cc1)C(=O)N(CC(=O)Nc1cc(F)cc(F)c1)C1CCCCC1
InChI Key InChIKey=WUYHLEOKEGRNPA-UHFFFAOYSA-N
Data  2 IC50
  Tab Delimited (TSV)   2D SDfile   Computed 3D by Vconf -m prep SDfile
Find this compound or compounds like it in BindingDB:
Activity Spreadsheet -- Enzyme Inhibition Constant Data from BindingDB
Found 2 hits for monomerid = 50419228
TargetSodium- and chloride-dependent glycine transporter 1(Homo sapiens (Human))
Glaxosmithkline
Curated by ChEMBL
LigandPNGBDBM50419228(CHEMBL1835879)
Affinity DataIC50:  501nM. Assay description: Inhibition of GlyT1 expressed in HEK293 cells assessed as inhibition of [3H]glycine uptake by scintillation proximity binding assay
In DepthDetails ArticlePubMed
TargetSodium- and chloride-dependent glycine transporter 2(Homo sapiens (Human))
Glaxosmithkline
Curated by ChEMBL
LigandPNGBDBM50419228(CHEMBL1835879)
Affinity DataIC50: <2.51E+4nM. Assay description: Inhibition of GlyT2 expressed in HEK293 cells assessed as inhibition of [3H]glycine uptake by scintillation proximity binding assay
In DepthDetails ArticlePubMed