BDBM50419234 CHEMBL1835881
SMILES Fc1cc(F)cc(NC(=O)CN(C2CCCCC2)C(=O)C2CCOCC2)c1
InChI Key InChIKey=NZDOZDVQNOJVEM-UHFFFAOYSA-N
Data  2 IC50
  Tab Delimited (TSV)   2D SDfile   Computed 3D by Vconf -m prep SDfile
Find this compound or compounds like it in BindingDB:
Activity Spreadsheet -- Enzyme Inhibition Constant Data from BindingDB
Found 2 hits for monomerid = 50419234
TargetSodium- and chloride-dependent glycine transporter 1(Homo sapiens (Human))
Glaxosmithkline
Curated by ChEMBL
LigandPNGBDBM50419234(CHEMBL1835881)
Affinity DataIC50:  5.01E+3nM. Assay description: Inhibition of GlyT1 expressed in HEK293 cells assessed as inhibition of [3H]glycine uptake by scintillation proximity binding assay
In DepthDetails ArticlePubMed
TargetSodium- and chloride-dependent glycine transporter 2(Homo sapiens (Human))
Glaxosmithkline
Curated by ChEMBL
LigandPNGBDBM50419234(CHEMBL1835881)
Affinity DataIC50: <2.51E+4nM. Assay description: Inhibition of GlyT2 expressed in HEK293 cells assessed as inhibition of [3H]glycine uptake by scintillation proximity binding assay
In DepthDetails ArticlePubMed