BDBM50419633 CHEMBL1940811
SMILES OCc1cc(ccc1O)C(O)CNCCc1ccc(CCNCC(O)c2ccc(O)c(CO)c2)cc1
InChI Key InChIKey=OVXWFIABWDSTPU-UHFFFAOYSA-N
Data  1 IC50
  Tab Delimited (TSV)   2D SDfile   Computed 3D by Vconf -m prep SDfile
Find this compound or compounds like it in BindingDB:
Activity Spreadsheet -- Enzyme Inhibition Constant Data from BindingDB
Found 1 hit for monomerid = 50419633
TargetBeta-2 adrenergic receptor(Homo sapiens (Human))
Theravance
Curated by ChEMBL
LigandPNGBDBM50419633(CHEMBL1940811)
Affinity DataIC50:  1.00E+5nM. Assay description: Displacement of [3H]dihydroalprenolol from beta2-adrenoceptor after 90 mins by liquid scintillation counting
In DepthDetails ArticlePubMed