BDBM50419662 CHEMBL1945294
SMILES O[C@@H](CNCCc1cccc(CN2CCCC2)c1)c1ccc(O)c2[nH]c(=O)sc12
InChI Key InChIKey=QWWLVVDOGURJDF-IBGZPJMESA-N
Data  4 IC50  1 EC50
  Tab Delimited (TSV)   2D SDfile   Computed 3D by Vconf -m prep SDfile
Find this compound or compounds like it in BindingDB:
Activity Spreadsheet -- Enzyme Inhibition Constant Data from BindingDB
Found 5 hits for monomerid = 50419662
TargetBeta-2 adrenergic receptor(Homo sapiens (Human))
Astrazeneca
Curated by ChEMBL
LigandPNGBDBM50419662(CHEMBL1945294)
Affinity DataEC50:  0.631nM. Assay description: Agonist activity at human beta2 adrenoceptor expressed in H292 cells assessed as increase in cAMP accumulation after 60 mins by spectrophotometry
In DepthDetails ArticlePubMed
TargetBeta-2 adrenergic receptor(Homo sapiens (Human))
Astrazeneca
Curated by ChEMBL
LigandPNGBDBM50419662(CHEMBL1945294)
Affinity DataIC50:  4nM. Assay description: Displacement of radiolabeled iodocyanopindolol from recombinant beta2 adrenoceptor
In DepthDetails ArticlePubMed
TargetBeta-1 adrenergic receptor(Homo sapiens (Human))
Astrazeneca
Curated by ChEMBL
LigandPNGBDBM50419662(CHEMBL1945294)
Affinity DataIC50:  316nM. Assay description: Displacement of radiolabeled iodocyanopindolol from beta1 adrenoceptor
In DepthDetails ArticlePubMed
TargetD(2) dopamine receptor(Homo sapiens (Human))
Astrazeneca
Curated by ChEMBL
LigandPNGBDBM50419662(CHEMBL1945294)
Affinity DataIC50:  3.16E+3nM. Assay description: Binding affinity to dopamine D2 receptor expressed in HEK cells by GTPgammaS binding assay
In DepthDetails ArticlePubMed
TargetAlpha-1D adrenergic receptor(Homo sapiens (Human))
Astrazeneca
Curated by ChEMBL
LigandPNGBDBM50419662(CHEMBL1945294)
Affinity DataIC50:  1.00E+3nM. Assay description: Binding affinity to Alpha-1D adrenoceptor expressed in HEK cells by calcium flux assay
In DepthDetails ArticlePubMed