BDBM50419751 DEPTROPINE
SMILES CN1[C@H]2CC[C@@H]1C[C@@H](C2)OC1c2ccccc2CCc2ccccc12
InChI Key InChIKey=ZWPODSUQWXAZNC-PMOLBWCYSA-N
Data  2 KI
  Tab Delimited (TSV)   2D SDfile   Computed 3D by Vconf -m prep SDfile
Find this compound or compounds like it in BindingDB:
Activity Spreadsheet -- Enzyme Inhibition Constant Data from BindingDB
Found 2 hits for monomerid = 50419751
TargetAcetylcholine-binding protein(Lymnaea stagnalis)
Vu University Amsterdam
Curated by ChEMBL
LigandPNGBDBM50419751(DEPTROPINE)
Affinity DataKi:  2.00E+3nM. Assay description: Displacement of [3H]epibatidine from Lymnaea stagnalis acetylcholine binding protein expressed using baculoviral system after 1.5 hrs by scintillatio...
In DepthDetails ArticlePubMed
TargetSoluble acetylcholine receptor(Aplysia Californica)
Vu University Amsterdam
Curated by ChEMBL
LigandPNGBDBM50419751(DEPTROPINE)
Affinity DataKi:  6.31E+3nM. Assay description: Displacement of [3H]epibatidine from Aplysia californica acetylcholine binding protein expressed using baculoviral system after 1.5 hrs by scintillat...
In DepthDetails ArticlePubMed