BDBM50419753 CHEMBL1947047
SMILES OC(CN1[C@H]2CC[C@@H]1C[C@@H](C2)OC1c2ccccc2CCc2ccccc12)c1ccccc1
InChI Key InChIKey=VUFNUKBMMACISY-YIQUMBJJSA-N
Data  4 KI
  Tab Delimited (TSV)   2D SDfile   Computed 3D by Vconf -m prep SDfile
Find this compound or compounds like it in BindingDB:
Activity Spreadsheet -- Enzyme Inhibition Constant Data from BindingDB
Found 4 hits for monomerid = 50419753
TargetAcetylcholine-binding protein(Lymnaea stagnalis)
Vu University Amsterdam
Curated by ChEMBL
LigandPNGBDBM50419753(CHEMBL1947047)
Affinity DataKi:  2.00E+3nM. Assay description: Displacement of [3H]epibatidine from Lymnaea stagnalis acetylcholine binding protein expressed using baculoviral system after 1.5 hrs by scintillatio...
In DepthDetails ArticlePubMed
TargetSoluble acetylcholine receptor(Aplysia Californica)
Vu University Amsterdam
Curated by ChEMBL
LigandPNGBDBM50419753(CHEMBL1947047)
Affinity DataKi:  1.26E+4nM. Assay description: Displacement of [3H]epibatidine from Aplysia californica acetylcholine binding protein expressed using baculoviral system after 1.5 hrs by scintillat...
In DepthDetails ArticlePubMed
TargetNeuronal acetylcholine receptor subunit alpha-7(Homo sapiens (Human))
Vu University Amsterdam
Curated by ChEMBL
LigandPNGBDBM50419753(CHEMBL1947047)
Affinity DataKi:  2.00E+4nM. Assay description: Displacement of [3H]MLA from nAChR alpha7 receptor in human SH-SY5Y cells by scintillation counting
In DepthDetails ArticlePubMed
TargetNeuronal acetylcholine receptor subunit alpha-4/beta-2(Homo sapiens (Human))
Vu University Amsterdam
Curated by ChEMBL
LigandPNGBDBM50419753(CHEMBL1947047)
Affinity DataKi: >3.16E+4nM. Assay description: Displacement of [3H]epibatidine from human nAChR alpha4beta2 receptor expressed in human HEK293T cells by scintillation counting
In DepthDetails ArticlePubMed