BDBM50419885 CHEMBL157206
SMILES CC(Oc1c(CC=C)cccc1CC=C)C1=NCCN1
InChI Key InChIKey=YAYASQTZIRSRFB-UHFFFAOYSA-N
Data  3 KI  2 EC50
  Tab Delimited (TSV)   2D SDfile   Computed 3D by Vconf -m prep SDfile
Find this compound or compounds like it in BindingDB:
Activity Spreadsheet -- Enzyme Inhibition Constant Data from BindingDB
Found 5 hits for monomerid = 50419885
TargetAlpha-2A adrenergic receptor(Homo sapiens (Human))
Universit£
Curated by ChEMBL
LigandPNGBDBM50419885(CHEMBL157206)
Affinity DataKi:  17nM. Assay description: Agonist activity at human adrenoceptor aplha 2A expressed in CHO cells assessed as rate of extracellular acidification by cytosensor microphysiometri...
In DepthDetails ArticlePubMed
TargetAlpha-2C adrenergic receptor(Homo sapiens (Human))
Universit£
Curated by ChEMBL
LigandPNGBDBM50419885(CHEMBL157206)
Affinity DataKi:  129nM. Assay description: Displacement of [3H]RS-79948-197 from human adrenoceptor aplha 2C expressed in CHO cells
In DepthDetails ArticlePubMed
TargetAlpha-2B adrenergic receptor(Homo sapiens (Human))
Universit£
Curated by ChEMBL
LigandPNGBDBM50419885(CHEMBL157206)
Affinity DataKi:  275nM. Assay description: Displacement of [3H]RS-79948-197 from human adrenoceptor aplha 2B expressed in CHO cells
In DepthDetails ArticlePubMed
TargetAlpha-2C adrenergic receptor(Homo sapiens (Human))
Universit£
Curated by ChEMBL
LigandPNGBDBM50419885(CHEMBL157206)
Affinity DataEC50:  56nM. Assay description: Agonist activity at human adrenoceptor aplha 2C expressed in CHO cells assessed as rate of extracellular acidification by cytosensor microphysiometri...
In DepthDetails ArticlePubMed
TargetAlpha-2B adrenergic receptor(Homo sapiens (Human))
Universit£
Curated by ChEMBL
LigandPNGBDBM50419885(CHEMBL157206)
Affinity DataEC50:  501nM. Assay description: Agonist activity at human adrenoceptor aplha 2B expressed in CHO cells assessed as rate of extracellular acidification by cytosensor microphysiometri...
In DepthDetails ArticlePubMed