BDBM50419932 IDRONOXIL
SMILES Oc1ccc(cc1)C1=Cc2ccc(O)cc2OC1
InChI Key InChIKey=ZZUBHVMHNVYXRR-UHFFFAOYSA-N
Data  1 IC50
  Tab Delimited (TSV)   2D SDfile   Computed 3D by Vconf -m prep SDfile
Find this compound or compounds like it in BindingDB:
Activity Spreadsheet -- Enzyme Inhibition Constant Data from BindingDB
Found 1 hit for monomerid = 50419932
TargetEstrogen receptor(RAT)
University Of Melbourne
Curated by ChEMBL
LigandPNGBDBM50419932(IDRONOXIL)
Affinity DataIC50:  661nM. Assay description: Displacement of [3H]estradiol from rat uterine cytosolic estrogen receptor
In DepthDetails ArticlePubMed