BDBM50420103 CHEMBL2057374
SMILES CCCC(=O)Nc1nc2c(OC)ccc(C)c2s1
InChI Key InChIKey=MGLGMPYSSRJNNR-UHFFFAOYSA-N
Data  1 EC50
  Tab Delimited (TSV)   2D SDfile   Computed 3D by Vconf -m prep SDfile
Find this compound or compounds like it in BindingDB:
Activity Spreadsheet -- Enzyme Inhibition Constant Data from BindingDB
Found 1 hit for monomerid = 50420103
TargetMuscarinic acetylcholine receptor M4(Homo sapiens (Human))
Vanderbilt University Medical Center
Curated by ChEMBL
LigandPNGBDBM50420103(CHEMBL2057374)
Affinity DataEC50: >1.00E+4nM. Assay description: Positive allosteric modulation of human M4 receptor expressed in CHO-K1 cells coexpressing Gqi5 assessed as potentiation of acetylcholine-mediated ca...
In DepthDetails ArticlePubMed