BDBM50420198 CHEMBL2074701
SMILES OC(COP(O)(O)=O)C(=O)OP(O)(O)=O
InChI Key InChIKey=LJQLQCAXBUHEAZ-UHFFFAOYSA-N
Data  1 KI
PDB links: 2 PDB IDs match this monomer.
  Tab Delimited (TSV)   2D SDfile   Computed 3D by Vconf -m prep SDfile
Find this compound or compounds like it in BindingDB:
Activity Spreadsheet -- Enzyme Inhibition Constant Data from BindingDB
Found 1 hit for monomerid = 50420198
TargetSolute carrier organic anion transporter family member 2A1(Homo sapiens (Human))
Albert Einstein College Of Medicine
Curated by ChEMBL
LigandPNGBDBM50420198(CHEMBL2074701)
Affinity DataKi:  5.70E+7nM. Assay description: TP_TRANSPORTER: inhibition of PGE2 uptake in PGT-expressing HeLa cells
In DepthDetails ArticlePubMed