BDBM50420397 CHEMBL2086422
SMILES OC(=O)c1[nH]c2cc(O)c(O)cc2c1-c1ccsc1
InChI Key InChIKey=BXECWMMWBPCAOY-UHFFFAOYSA-N
Data  2 EC50
  Tab Delimited (TSV)   2D SDfile   Computed 3D by Vconf -m prep SDfile
Find this compound or compounds like it in BindingDB:
Activity Spreadsheet -- Enzyme Inhibition Constant Data from BindingDB
Found 2 hits for monomerid = 50420397
TargetG-protein coupled receptor 35(Homo sapiens (Human))
TBA
Curated by ChEMBL
LigandPNGBDBM50420397(CHEMBL2086422)
Affinity DataEC50:  1.03E+4nM. Assay description: Agonist activity at GPR35 in human HT-29 cells measured after 10 mins by dynamic mass redistribution assay
In DepthDetails ArticlePubMed
TargetG-protein coupled receptor 35(Homo sapiens (Human))
TBA
Curated by ChEMBL
LigandPNGBDBM50420397(CHEMBL2086422)
Affinity DataEC50:  6.12E+4nM. Assay description: Agonist activity at human GPR35 expressed in U2OS cells coexpressing Gal4-VP16/beta-arrestin fusion protein after 5 hrs by tango beta-arrestin transl...
In DepthDetails ArticlePubMed