BDBM50420519 CHEMBL2086519
SMILES C=CC(=O)Nc1ccc(cc1)S(=O)(=O)N1CCN(CC1)C(=O)OC1CCCC1
InChI Key InChIKey=PXHUPSZLKUMVDF-UHFFFAOYSA-N
Data  4 IC50
  Tab Delimited (TSV)   2D SDfile   Computed 3D by Vconf -m prep SDfile
Find this compound or compounds like it in BindingDB:
Activity Spreadsheet -- Enzyme Inhibition Constant Data from BindingDB
Found 4 hits for monomerid = 50420519
TargetProtein-glutamine gamma-glutamyltransferase K(Homo sapiens (Human))
Evotec (Uk)
Curated by ChEMBL
LigandPNGBDBM50420519(CHEMBL2086519)
Affinity DataIC50:  2.50E+3nM. Assay description: Inhibition of human recombinant TG1 by fluorescent transamidation assay
In DepthDetails ArticlePubMed
TargetProtein-glutamine gamma-glutamyltransferase 2(Homo sapiens (Human))
Evotec (Uk)
Curated by ChEMBL
LigandPNGBDBM50420519(CHEMBL2086519)
Affinity DataIC50:  44nM. Assay description: Inhibition of human recombinant TG2 by fluorescent transamidation assay
In DepthDetails ArticlePubMed
TargetCoagulation factor XIII A chain(Homo sapiens (Human))
Evotec (Uk)
Curated by ChEMBL
LigandPNGBDBM50420519(CHEMBL2086519)
Affinity DataIC50:  240nM. Assay description: Inhibition of thrombin activated human F13a by fluorescent transamidation assay
In DepthDetails ArticlePubMed
TargetProtein-glutamine gamma-glutamyltransferase E(Homo sapiens (Human))
Evotec (Uk)
Curated by ChEMBL
LigandPNGBDBM50420519(CHEMBL2086519)
Affinity DataIC50: >8.00E+4nM. Assay description: Inhibition of thrombin activated human TG3 by fluorescent transamidation assay
In DepthDetails ArticlePubMed