BDBM50420562 CHEMBL2048144
SMILES OC(=O)Cc1ccn(c1)-c1cncc(n1)-n1ncc2ccc(NC3CCCC3)cc12
InChI Key InChIKey=YQTMYRNBXJDYDN-UHFFFAOYSA-N
Data  2 IC50
PDB links: 1 PDB ID matches this monomer.
  Tab Delimited (TSV)   2D SDfile   Computed 3D by Vconf -m prep SDfile
Find this compound or compounds like it in BindingDB:
Activity Spreadsheet -- Enzyme Inhibition Constant Data from BindingDB
Found 2 hits for monomerid = 50420562
TargetCasein kinase II subunit alpha'(Homo sapiens (Human))
Kyoto University
Curated by ChEMBL
LigandPNGBDBM50420562(CHEMBL2048144)
Affinity DataIC50:  190nM. Assay description: Competitive inhibition of GST fused human CK2alpha' expressed in Escherichia coli BL21 after 10 mins in presence of ATP
TargetCasein kinase II subunit alpha(Homo sapiens (Human))
Kyoto University
Curated by ChEMBL
LigandPNGBDBM50420562(CHEMBL2048144)
Affinity DataIC50:  110nM. Assay description: Competitive inhibition of GST fused human CK2alpha expressed in Escherichia coli BL21 after 10 mins in presence of ATP