BDBM50420835 CHEMBL2086691
SMILES C[C@@H]1CN(CCN1c1ncc(OCc2ccncc2C#N)cn1)c1noc(n1)C1CC1
InChI Key InChIKey=NEUZVFSMXDYIRA-CQSZACIVSA-N
Data  2 EC50
  Tab Delimited (TSV)   2D SDfile   Computed 3D by Vconf -m prep SDfile
Find this compound or compounds like it in BindingDB:
Activity Spreadsheet -- Enzyme Inhibition Constant Data from BindingDB
Found 2 hits for monomerid = 50420835
TargetGlucose-dependent insulinotropic receptor(Mus musculus)
Astrazeneca
Curated by ChEMBL
LigandPNGBDBM50420835(CHEMBL2086691)
Affinity DataEC50:  89nM. Assay description: Agonist activity at mouse GPR119 receptor assessed as increase in cAMP level after 45 mins by HTRF assay
In DepthDetails ArticlePubMed
TargetGlucose-dependent insulinotropic receptor(Homo sapiens (Human))
Astrazeneca
Curated by ChEMBL
LigandPNGBDBM50420835(CHEMBL2086691)
Affinity DataEC50:  14nM. Assay description: Agonist activity at human GPR119 receptor over expressed in HEK293S cells assessed as increase in cAMP level after 45 mins by HTRF assay
In DepthDetails ArticlePubMed