BDBM50421266 CHEMBL2087885
SMILES C(Nc1ncnc2sc(c(-c3ccccc3)c12)-c1ccccc1)[C@@H]1CCCO1
InChI Key InChIKey=UCKQNNIWWBGUGY-SFHVURJKSA-N
Data  1 KI
  Tab Delimited (TSV)   2D SDfile   Computed 3D by Vconf -m prep SDfile
Find this compound or compounds like it in BindingDB:
Activity Spreadsheet -- Enzyme Inhibition Constant Data from BindingDB
Found 1 hit for monomerid = 50421266
TargetActivated CDC42 kinase 1(Homo sapiens (Human))
Amgen
Curated by ChEMBL
LigandPNGBDBM50421266(CHEMBL2087885)
Affinity DataKi: >1.00E+4nM. Assay description: Inhibition of N-terminal His6-tagged ACK1 expressed in baculovirus infected Hi5 cells assessed as inhibition of autophosphorylation after 2 hrs by EL...
In DepthDetails ArticlePubMed