BDBM50421409 CHEMBL318779
SMILES CSCC[C@H](NC(=O)[C@H](CC(C)C)NC(=O)[C@H](CC(C)C)NC(C)=O)C=O
InChI Key InChIKey=RJWLAIMXRBDUMH-ULQDDVLXSA-N
Data  1 IC50
  Tab Delimited (TSV)   2D SDfile   Computed 3D by Vconf -m prep SDfile
Find this compound or compounds like it in BindingDB:
Activity Spreadsheet -- Enzyme Inhibition Constant Data from BindingDB
Found 3 hits for monomerid = 50421409
TargetCalpain-1 catalytic subunit(Homo sapiens (Human))
TBA
Curated by ChEMBL
LigandPNGBDBM50421409(CHEMBL318779)
Affinity DataIC50:  23nM. Assay description: Inhibitory activity evaluated against recombinant human calpain 1
In DepthDetails Article
TargetReplicase polyprotein 1ab(2019-nCoV)TBA
LigandPNGBDBM50421409(CHEMBL318779)
Affinity DataIC50:  2.00E+3nM
In DepthDetails
TargetReplicase polyprotein 1ab(2019-nCoV)TBA
LigandPNGBDBM50421409(CHEMBL318779)
Affinity DataIC50:  8.60E+3nM. Assay description: In vitro inhibition of dihydropteroate synthase from Escherichia coli.
In DepthDetails