BDBM50421557 CHEMBL111304
SMILES CC(C)(C)c1cc(COCC(N2CCNCC2)c2ccccc2)cc(c1)C(C)(C)C
InChI Key InChIKey=SKFQAUXRVOPVSQ-UHFFFAOYSA-N
Data  1 KI  2 IC50
  Tab Delimited (TSV)   2D SDfile   Computed 3D by Vconf -m prep SDfile
Find this compound or compounds like it in BindingDB:
Activity Spreadsheet -- Enzyme Inhibition Constant Data from BindingDB
Found 3 hits for monomerid = 50421557
TargetSubstance-P receptor(Homo sapiens (Human))
Ucb Pharma
Curated by ChEMBL
LigandPNGBDBM50421557(CHEMBL111304)
Affinity DataKi:  100nM. Assay description: Displacement of [3H]-substance P from human NK1 receptor expressed in CHO cellsChecked by Author
In DepthDetails ArticlePubMed
TargetSodium-dependent serotonin transporter(Rattus norvegicus (rat))
Ucb Pharma
Curated by ChEMBL
LigandPNGBDBM50421557(CHEMBL111304)
Affinity DataIC50:  1.00E+3nM. Assay description: Binding affinity against Serotonin transporter in rat cerebral cortex using [3H]paroxetine binding assay.
In DepthDetails ArticlePubMed
TargetSubstance-P receptor(Homo sapiens (Human))
Ucb Pharma
Curated by ChEMBL
LigandPNGBDBM50421557(CHEMBL111304)
Affinity DataIC50:  100nM. Assay description: Binding affinity against human Tachykinin receptor 1 expressed in CHO cells using [3H]-substance P as the radioligand
In DepthDetails ArticlePubMed