BDBM50421723 CHEMBL321468
SMILES CC(C)NCC(O)c1ccc(O)c(CO)c1
InChI Key InChIKey=NUXIPOBJYISIHW-UHFFFAOYSA-N
Data  2 Kd
  Tab Delimited (TSV)   2D SDfile   Computed 3D by Vconf -m prep SDfile
Find this compound or compounds like it in BindingDB:
Activity Spreadsheet -- Enzyme Inhibition Constant Data from BindingDB
Found 2 hits for monomerid = 50421723
TargetBeta-2 adrenergic receptor(BOVINE)
TBA
Curated by ChEMBL
LigandPNGBDBM50421723(CHEMBL321468)
Affinity DataKd:  1.59E+3nM. Assay description: Affinity for cow beta-2 adrenergic receptor by measuring displacement (-)-[3H]dihydroalprenolol (DHA)
In DepthDetails ArticlePubMed
TargetBeta-2 adrenergic receptor(BOVINE)
TBA
Curated by ChEMBL
LigandPNGBDBM50421723(CHEMBL321468)
Affinity DataKd:  3.16E+3nM. Assay description: Affinity for cow beta-2 adrenergic receptor by measuring displacement (-)-[3H]dihydroalprenolol (DHA)
In DepthDetails ArticlePubMed