BDBM50421964 CHEMBL2310858
SMILES CCCC1CCN([C@@H](C)C(=O)N[C@@H](CC(O)=O)C(=O)N(C)[C@@H](Cc2ccccc2)C(N)=O)[C@H]1C(=O)[C@H](Cc1c[nH]c2ccccc12)NC(=O)CNC(=O)[C@@H]1CCCN1C(=O)CCc1ccc(OS(O)(=O)=O)cc1
InChI Key InChIKey=UIOFZBXVGACHJB-JXBJRDHYSA-N
Data  2 IC50
  Tab Delimited (TSV)   2D SDfile   Computed 3D by Vconf -m prep SDfile
Find this compound or compounds like it in BindingDB:
Activity Spreadsheet -- Enzyme Inhibition Constant Data from BindingDB
Found 2 hits for monomerid = 50421964
TargetCholecystokinin receptor type A(Cavia porcellus)
Abbott Laboratories
Curated by ChEMBL
LigandPNGBDBM50421964(CHEMBL2310858)
Affinity DataIC50:  7.30nM. Assay description: Evaluated in vitro for its binding affinity towards cholecystokinin type A receptor of guinea pig pancreas
In DepthDetails ArticlePubMed
TargetGastrin/cholecystokinin type B receptor(Homo sapiens (Human))
Abbott Laboratories
Curated by ChEMBL
LigandPNGBDBM50421964(CHEMBL2310858)
Affinity DataIC50:  0.900nM. Assay description: Evaluated in vitro for its binding affinity towards cholecystokinin type B receptor of guinea pig cortex
In DepthDetails ArticlePubMed