BDBM50421968 CHEMBL540311
SMILES Cc1ncsc1CCN
InChI Key InChIKey=TVAQJFUNSFVSGP-UHFFFAOYSA-N
Data  1 Kd
  Tab Delimited (TSV)   2D SDfile   Computed 3D by Vconf -m prep SDfile
Find this compound or compounds like it in BindingDB:
Activity Spreadsheet -- Enzyme Inhibition Constant Data from BindingDB
Found 1 hit for monomerid = 50421968
TargetHistamine H2 receptor(Cavia porcellus (domestic guinea pig))
Vrije Universiteit
Curated by ChEMBL
LigandPNGBDBM50421968(CHEMBL540311)
Affinity DataKd:  3.55E+5nM. Assay description: Compound is evaluated for histamine H2 receptor agonistic activity in guinea pig cerebral cortex using [3H]tiotidine as radioligand
In DepthDetails ArticlePubMed