BDBM50421973 CHEMBL610727
SMILES CC(C)(C)CN=Nc1nc(N)c2ncn(C3O[C@H](CO)[C@@H](O)[C@H]3O)c2n1
InChI Key InChIKey=SFQOOJKULUJTRB-RJNFYWFKSA-N
Data  2 EC50
  Tab Delimited (TSV)   2D SDfile   Computed 3D by Vconf -m prep SDfile
Find this compound or compounds like it in BindingDB:
Activity Spreadsheet -- Enzyme Inhibition Constant Data from BindingDB
Found 2 hits for monomerid = 50421973
TargetAdenosine receptor A2a/A2b(Homo sapiens (Human))
University Of South Florida
Curated by ChEMBL
LigandPNGBDBM50421973(CHEMBL610727)
Affinity DataEC50:  35nM. Assay description: In vitro effect on coronary vasodilation in guinea pig heart.
In DepthDetails ArticlePubMed
TargetAdenosine receptor A1(GUINEA PIG)
University Of South Florida
Curated by ChEMBL
LigandPNGBDBM50421973(CHEMBL610727)
Affinity DataEC50:  2.51E+4nM. Assay description: In vitro prolonging of the stimulus-QRS interval in guinea pig heart.
In DepthDetails ArticlePubMed