BDBM50421987 CHEMBL611919
SMILES CCC(CC)N=Nc1nc(N)c2ncn(C3O[C@H](CO)[C@@H](O)[C@H]3O)c2n1
InChI Key InChIKey=YJPXQNIYHMGQMI-OYBGHCQBSA-N
Data  2 EC50
  Tab Delimited (TSV)   2D SDfile   Computed 3D by Vconf -m prep SDfile
Find this compound or compounds like it in BindingDB:
Activity Spreadsheet -- Enzyme Inhibition Constant Data from BindingDB
Found 2 hits for monomerid = 50421987
TargetAdenosine receptor A2a/A2b(Homo sapiens (Human))
University Of South Florida
Curated by ChEMBL
LigandPNGBDBM50421987(CHEMBL611919)
Affinity DataEC50:  178nM. Assay description: In vitro effect on coronary vasodilation in guinea pig heart.
In DepthDetails ArticlePubMed
TargetAdenosine receptor A1(GUINEA PIG)
University Of South Florida
Curated by ChEMBL
LigandPNGBDBM50421987(CHEMBL611919)
Affinity DataEC50:  8.91E+3nM. Assay description: In vitro prolonging of the stimulus-QRS interval in guinea pig heart.
In DepthDetails ArticlePubMed