BDBM50422091 CHEMBL344978
SMILES CC(C)[C@H](NC(=O)[C@H](NCc1ccccc1)[C@H](O)[C@H](Cc1ccccc1)NC(=O)OC(C)(C)C)C(=O)NCc1ccccc1
InChI Key InChIKey=FJIFQKRKEGFBRT-SYQUUIDJSA-N
Data  1 KI
  Tab Delimited (TSV)   2D SDfile   Computed 3D by Vconf -m prep SDfile
Find this compound or compounds like it in BindingDB:
Activity Spreadsheet -- Enzyme Inhibition Constant Data from BindingDB
Found 1 hit for monomerid = 50422091
TargetGag-Pol polyprotein [489-587](Human immunodeficiency virus type 1)
Sandoz Forschungsinstitut Ges.M.B.H.
Curated by ChEMBL
LigandPNGBDBM50422091(CHEMBL344978)
Affinity DataKi:  158nM. Assay description: Inhibitory activity was determined against HIV type 1 protease
In DepthDetails ArticlePubMed