BDBM50422234 CHEMBL6412
SMILES COc1nc(Cl)cnc1NS(=O)(=O)c1cccc2c(cccc12)N(C)C
InChI Key InChIKey=ZEICTPGVQAZONR-UHFFFAOYSA-N
Data  1 IC50
  Tab Delimited (TSV)   2D SDfile   Computed 3D by Vconf -m prep SDfile
Find this compound or compounds like it in BindingDB:
Activity Spreadsheet -- Enzyme Inhibition Constant Data from BindingDB
Found 1 hit for monomerid = 50422234
TargetEndothelin-1 receptor(Homo sapiens (Human))
Zeneca Pharmaceuticals
Curated by ChEMBL
LigandPNGBDBM50422234(CHEMBL6412)
Affinity DataIC50:  10nM. Assay description: Inhibition of specific binding of [125-I]ET-1 to human endothelin A receptor
In DepthDetails ArticlePubMed