BDBM50422358 CHEMBL2303994
SMILES CN(C)c1cccc2c(cccc12)S(=O)(=O)Nc1cc(CCC(=O)c2c(O)cc(O)cc2O[C@@H]2O[C@@H](CO)[C@@H](O)[C@H](O)[C@@H]2O)ccc1O
InChI Key InChIKey=KSNMDWBWETXRGZ-BOYVGMIQSA-N
Data  1 KI
  Tab Delimited (TSV)   2D SDfile   Computed 3D by Vconf -m prep SDfile
Find this compound or compounds like it in BindingDB:
Activity Spreadsheet -- Enzyme Inhibition Constant Data from BindingDB
Found 1 hit for monomerid = 50422358
TargetSodium/glucose cotransporter 1(Homo sapiens (Human))
Max-Planck-Institut F£R Molekulare Physiologie
Curated by ChEMBL
LigandPNGBDBM50422358(CHEMBL2303994)
Affinity DataKi:  9.43E+4nM. Assay description: Binding affinity against Sodium/glucose co-transporter of isolated renal brush border membranes.
In DepthDetails ArticlePubMed