BDBM50422578 CHEMBL422623
SMILES CS(=O)(=O)c1ccc(cc1)-c1oc2ccccc2c(=S)c1-c1ccccc1
InChI Key InChIKey=IDYBRYMFBQKRBI-UHFFFAOYSA-N
Data  2 IC50
  Tab Delimited (TSV)   2D SDfile   Computed 3D by Vconf -m prep SDfile
Find this compound or compounds like it in BindingDB:
Activity Spreadsheet -- Enzyme Inhibition Constant Data from BindingDB
Found 2 hits for monomerid = 50422578
TargetProstaglandin G/H synthase 2(Mus musculus (Mouse))
Amorepacific
Curated by ChEMBL
LigandPNGBDBM50422578(CHEMBL422623)
Affinity DataIC50:  101nM. Assay description: In vitro inhibitory concentration against prostaglandin G/H synthase 2 using freshly harvested mouse peritoneal macrophages
In DepthDetails ArticlePubMed
TargetProstaglandin G/H synthase 2(Mus musculus (Mouse))
Amorepacific
Curated by ChEMBL
LigandPNGBDBM50422578(CHEMBL422623)
Affinity DataIC50:  1.02E+5nM. Assay description: In vitro inhibitory activity against Prostaglandin G/H synthase 2 from mouse peritoneal macrophages
In DepthDetails ArticlePubMed