BDBM50422979 CHEMBL228746
SMILES Cc1ccc(-c2cc(Br)ccc2OCc2ccc(F)cc2)n1-c1cc(C(O)=O)c2ccccc2c1
InChI Key InChIKey=AWMLNTVUSMLGPO-UHFFFAOYSA-N
Data  1 IC50
  Tab Delimited (TSV)   2D SDfile   Computed 3D by Vconf -m prep SDfile
Find this compound or compounds like it in BindingDB:
Activity Spreadsheet -- Enzyme Inhibition Constant Data from BindingDB
Found 1 hit for monomerid = 50422979
TargetProstaglandin E2 receptor EP1 subtype(Homo sapiens (Human))
Glaxosmithkline
Curated by ChEMBL
LigandPNGBDBM50422979(CHEMBL228746)
Affinity DataIC50:  5nM. Assay description: Displacement of [3H]PGE2 from human recombinant EP1 receptor expressed in CHOK1 cell membrane
In DepthDetails ArticlePubMed