BDBM50423304 CHEMBL248717
SMILES COc1ccc(SC)c2C[C@@H]3[C@H](C[C@H](CN3C)C(=O)N3CCN(CC3)c3ccc(cc3)[N+]([O-])=O)Cc12
InChI Key InChIKey=BIYHEELAFNLFEL-KHCICDEESA-N
Data  2 Kd
  Tab Delimited (TSV)   2D SDfile   Computed 3D by Vconf -m prep SDfile
Find this compound or compounds like it in BindingDB:
Activity Spreadsheet -- Enzyme Inhibition Constant Data from BindingDB
Found 2 hits for monomerid = 50423304
TargetSomatostatin receptor type 1(RAT)
Novartis Institutes For Biomedical Research
Curated by ChEMBL
LigandPNGBDBM50423304(CHEMBL248717)
Affinity DataKd:  7.90nM. Assay description: Displacement of [125I]SRIF14 from sst1 receptor in rat brain cortex membrane
In DepthDetails ArticlePubMed
TargetSomatostatin receptor type 2(RAT)
Novartis Institutes For Biomedical Research
Curated by ChEMBL
LigandPNGBDBM50423304(CHEMBL248717)
Affinity DataKd:  1.00E+4nM. Assay description: Displacement of [125I]SRIF14 from sst2 receptor in rat brain cortex membrane
In DepthDetails ArticlePubMed