BDBM50423485 CHEMBL445673
SMILES CCCCN1C[C@@H](C[C@H]2[C@H]1Cc1c(Br)[nH]c3cccc2c13)C(=O)N1CCN(CC1)c1ccccn1
InChI Key InChIKey=HKHRBWOCFLSICR-ZILOHOTNSA-N
Data  1 Kd
  Tab Delimited (TSV)   2D SDfile   Computed 3D by Vconf -m prep SDfile
Find this compound or compounds like it in BindingDB:
Activity Spreadsheet -- Enzyme Inhibition Constant Data from BindingDB
Found 1 hit for monomerid = 50423485
TargetSomatostatin receptor type 1(RAT)
Novartis Institutes For Biomedical Research
Curated by ChEMBL
LigandPNGBDBM50423485(CHEMBL445673)
Affinity DataKd:  1.15E+3nM. Assay description: Displacement of [125I]SRIF14 from sst1 receptor in rat cortex
In DepthDetails ArticlePubMed