BDBM50423529 CHEMBL408973
SMILES CC[C@]12CC(=C)[C@H]3[C@@H](CC[C@H]4CC(=O)CC[C@H]34)[C@@H]1CC[C@@]2(O)C#C
InChI Key InChIKey=KJERDZXUYXDSKQ-CDSHGXNMSA-N
Data  1 Kd
  Tab Delimited (TSV)   2D SDfile   Computed 3D by Vconf -m prep SDfile
Find this compound or compounds like it in BindingDB:
Activity Spreadsheet -- Enzyme Inhibition Constant Data from BindingDB
Found 1 hit for monomerid = 50423529
TargetSex hormone-binding globulin(Homo sapiens (Human))
University Of British Columbia
Curated by ChEMBL
LigandPNGBDBM50423529(CHEMBL408973)
Affinity DataKd:  1.60nM. Assay description: Displacement of [3H]5alpha dihydrotestosterone from human sex hormone binding globulin
In DepthDetails ArticlePubMed