BDBM50423651 CHEMBL2304616
SMILES Clc1ccc2n(C3CCN(CCNC(=O)C4C[C@@H]4c4ccccc4)CC3)c(=O)[nH]c2c1
InChI Key InChIKey=ZNFHTAUUBDJHTE-FIWHBWSRSA-N
Data  2 IC50
  Tab Delimited (TSV)   2D SDfile   Computed 3D by Vconf -m prep SDfile
Find this compound or compounds like it in BindingDB:
Activity Spreadsheet -- Enzyme Inhibition Constant Data from BindingDB
Found 2 hits for monomerid = 50423651
TargetPhospholipase D2(Homo sapiens (Human))
Vanderbilt University Medical Center
Curated by ChEMBL
LigandPNGBDBM50423651(CHEMBL2304616)
Affinity DataIC50:  520nM. Assay description: Inhibition of GFP-labelled human PLD2 HEK293 cells
In DepthDetails ArticlePubMed
TargetPhospholipase D1(Homo sapiens (Human))
Vanderbilt University Medical Center
Curated by ChEMBL
LigandPNGBDBM50423651(CHEMBL2304616)
Affinity DataIC50:  2nM. Assay description: Inhibition of human PLD1 in Calu1 cells
In DepthDetails ArticlePubMed