BDBM50423822 CHEMBL1830621
SMILES OC(CNCCOCCOCCNC(=O)CCCCCNC(=O)COc1ccc(\C=C\c2ccc3C=C4C=CC(c5cccs5)=[N+]4[B-](F)(F)n23)cc1)COc1cccc2[nH]ccc12
InChI Key InChIKey=GBEWRSJQTLMKTO-JLHYYAGUSA-N
Data  7 Kd
  Tab Delimited (TSV)   2D SDfile   Computed 3D by Vconf -m prep SDfile
Find this compound or compounds like it in BindingDB:
Activity Spreadsheet -- Enzyme Inhibition Constant Data from BindingDB
Found 7 hits for monomerid = 50423822
TargetBeta-2 adrenergic receptor(Homo sapiens (Human))
University Of Nottingham
Curated by ChEMBL
LigandPNGBDBM50423822(CHEMBL1830621)
Affinity DataKd:  7.20nM. Assay description: Antagonist activity at human beta-2 adrenergic receptor expressed in salbutamol-stimulated CHO-K1 cells assessed as CRE-SPAP level by fluorescence co...
In DepthDetails ArticlePubMed
TargetBeta-1 adrenergic receptor(Homo sapiens (Human))
University Of Nottingham
Curated by ChEMBL
LigandPNGBDBM50423822(CHEMBL1830621)
Affinity DataKd:  98nM. Assay description: Displacement of [3H]-CGP 12177 from human beta-1 adrenergic receptor expressed in CHOK1 cells
In DepthDetails ArticlePubMed
TargetBeta-1 adrenergic receptor(Homo sapiens (Human))
University Of Nottingham
Curated by ChEMBL
LigandPNGBDBM50423822(CHEMBL1830621)
Affinity DataKd: >1.00E+3nM. Assay description: Antagonist activity at human beta-1 adrenergic receptor site 1 expressed in CGP 12177-stimulated CHO-K1 cells assessed as CRE-SPAP level by fluoresce...
In DepthDetails ArticlePubMed
TargetBeta-3 adrenergic receptor(Homo sapiens (Human))
University Of Nottingham
Curated by ChEMBL
LigandPNGBDBM50423822(CHEMBL1830621)
Affinity DataKd:  380nM. Assay description: Antagonist activity at human beta-3 adrenergic receptor expressed in fenoterol-stimulated CHOK1 cells assessed as CRE-SPAP level by fluorescence corr...
In DepthDetails ArticlePubMed
TargetBeta-2 adrenergic receptor(Homo sapiens (Human))
University Of Nottingham
Curated by ChEMBL
LigandPNGBDBM50423822(CHEMBL1830621)
Affinity DataKd:  11nM. Assay description: Displacement of [3H]-CGP 12177 from human beta-2 adrenergic receptor expressed in CHOK1 cells
In DepthDetails ArticlePubMed
TargetBeta-1 adrenergic receptor(Homo sapiens (Human))
University Of Nottingham
Curated by ChEMBL
LigandPNGBDBM50423822(CHEMBL1830621)
Affinity DataKd:  38nM. Assay description: Antagonist activity at human beta-1 adrenergic receptor site 1 expressed in cimeterol-stimulated CHO-K1 cells assessed as CRE-SPAP level by fluoresce...
In DepthDetails ArticlePubMed
TargetBeta-3 adrenergic receptor(Homo sapiens (Human))
University Of Nottingham
Curated by ChEMBL
LigandPNGBDBM50423822(CHEMBL1830621)
Affinity DataKd:  288nM. Assay description: Antagonist activity at human beta-3 adrenergic receptor expressed in fenoterol-stimulated CHOK1 cells assessed as CRE-SPAP level by fluorescence corr...
In DepthDetails ArticlePubMed