BDBM50424018 CHEMBL2313782
SMILES COC1COCCC1N[C@@H]1C[C@H]2CCC[C@]2(C1)C(=O)N1CCc2ncc(Cl)cc2C1
InChI Key InChIKey=RSMJZHWPFORZOP-YEKMGZOJSA-N
Data  2 IC50
  Tab Delimited (TSV)   2D SDfile   Computed 3D by Vconf -m prep SDfile
Find this compound or compounds like it in BindingDB:
Activity Spreadsheet -- Enzyme Inhibition Constant Data from BindingDB
Found 2 hits for monomerid = 50424018
TargetPotassium voltage-gated channel subfamily H member 2(Homo sapiens (Human))
Janssen Research And Development
Curated by ChEMBL
LigandPNGBDBM50424018(CHEMBL2313782)
Affinity DataIC50:  3.33E+4nM. Assay description: Binding affinity to human ERG
In DepthDetails ArticlePubMed
TargetC-C chemokine receptor type 2(Homo sapiens (Human))
Janssen Research And Development
Curated by ChEMBL
LigandPNGBDBM50424018(CHEMBL2313782)
Affinity DataIC50:  1.10E+3nM. Assay description: Binding affinity to human CCR2
In DepthDetails ArticlePubMed