BDBM50424183 CHEMBL2312074
SMILES CCS(=O)(=O)c1ccc2nc(Oc3ccc(cc3)-c3ccccn3)[nH]c2c1
InChI Key InChIKey=DPKUOHAURWMUFA-UHFFFAOYSA-N
Data  1 IC50
  Tab Delimited (TSV)   2D SDfile   Computed 3D by Vconf -m prep SDfile
Find this compound or compounds like it in BindingDB:
Activity Spreadsheet -- Enzyme Inhibition Constant Data from BindingDB
Found 1 hit for monomerid = 50424183
TargetNeuropeptide Y receptor type 5(Mus musculus (Mouse))
Shionogi
Curated by ChEMBL
LigandPNGBDBM50424183(CHEMBL2312074)
Affinity DataIC50:  4.10nM. Assay description: Displacement of [125I]PYY from mouse NPY-Y5 receptor
In DepthDetails ArticlePubMed