BDBM50424195 CHEMBL2312461
SMILES Nc1ccccc1NC(=O)c1ccc(CCNc2nccc(n2)-c2cnc3ncccn23)cc1
InChI Key InChIKey=VSRZHFWTNNMUGO-UHFFFAOYSA-N
Data  1 IC50
  Tab Delimited (TSV)   2D SDfile   Computed 3D by Vconf -m prep SDfile
Find this compound or compounds like it in BindingDB:
Activity Spreadsheet -- Enzyme Inhibition Constant Data from BindingDB
Found 1 hit for monomerid = 50424195
TargetHistone deacetylase 1(Homo sapiens (Human))
The General Hospital Of Chinese People'S Liberation Army
Curated by ChEMBL
LigandPNGBDBM50424195(CHEMBL2312461)
Affinity DataIC50:  154nM. Assay description: Inhibition of HDAC1 (unknown origin)
In DepthDetails ArticlePubMed