BDBM50424293 CHEMBL2314446
SMILES CC(C)[C@@H](CO)Nc1nc(Nc2cncnc2)c2ncn(C(C)C)c2n1
InChI Key InChIKey=FQFGDUPFMGYOMB-CYBMUJFWSA-N
Data  2 IC50
  Tab Delimited (TSV)   2D SDfile   Computed 3D by Vconf -m prep SDfile
Find this compound or compounds like it in BindingDB:
Activity Spreadsheet -- Enzyme Inhibition Constant Data from BindingDB
Found 2 hits for monomerid = 50424293
TargetDual specificity tyrosine-phosphorylation-regulated kinase 1A(Homo sapiens (Human))
University Of Paris
Curated by ChEMBL
LigandPNGBDBM50424293(CHEMBL2314446)
Affinity DataIC50:  490nM. Assay description: Inhibition of recombinant GST-fused human DYRK1A expressed in Escherichia coli using KKISGRLSPIMTEQ as substrate
In DepthDetails ArticlePubMed
TargetCyclin-dependent kinase 5 activator 1(Homo sapiens (Human))
University Of Paris
Curated by ChEMBL
LigandPNGBDBM50424293(CHEMBL2314446)
Affinity DataIC50:  370nM. Assay description: Inhibition of recombinant human CDK5/p25 after 30 mins by scintillation counting
In DepthDetails ArticlePubMed