BDBM50424761 CHEMBL2314196
SMILES OC(=O)c1[nH]c2ccccc2c1CCCOc1cccc(Oc2ccccc2)c1
InChI Key InChIKey=RFOBYIOGQAFREM-UHFFFAOYSA-N
Data  1 KI
  Tab Delimited (TSV)   2D SDfile   Computed 3D by Vconf -m prep SDfile
Find this compound or compounds like it in BindingDB:
Activity Spreadsheet -- Enzyme Inhibition Constant Data from BindingDB
Found 1 hit for monomerid = 50424761
TargetInduced myeloid leukemia cell differentiation protein Mcl-1(Homo sapiens (Human))
Vanderbilt University School Of Medicine
Curated by ChEMBL
LigandPNGBDBM50424761(CHEMBL2314196)
Affinity DataKi:  5.20E+3nM. Assay description: Displacement of FITC-AHx-KALETLRRVGDGVQRNHETAF-NH2 from human MCl1 (172 to 327) expressed in Escherichia coli BL21 (DE3) after 1 hr by fluorescence p...
In DepthDetails ArticlePubMed