BDBM50424911 CHEMBL2315794
SMILES CC(C)Sc1nnc(CSc2ccccc2)n1-c1ccccc1
InChI Key InChIKey=NSVFALADEZSAPI-UHFFFAOYSA-N
Data  1 IC50
  Tab Delimited (TSV)   2D SDfile   Computed 3D by Vconf -m prep SDfile
Find this compound or compounds like it in BindingDB:
Activity Spreadsheet -- Enzyme Inhibition Constant Data from BindingDB
Found 1 hit for monomerid = 50424911
TargetTransitional endoplasmic reticulum ATPase(Homo sapiens (Human))
TBA
Curated by ChEMBL
LigandPNGBDBM50424911(CHEMBL2315794)
Affinity DataIC50:  7.73E+3nM. Assay description: Inhibition of human recombinant His-GST tagged VCP expressed in baculovirus infected Hi5 cells assessed as ADP formation incubated for 20 mins proir ...
In DepthDetails ArticlePubMed