BDBM50424995 CHEMBL2311772
SMILES CCCC(=O)N1CCCN(CC1)C1(C(=O)NC(=O)NC1=O)c1ccc(Oc2ccccc2)cc1
InChI Key InChIKey=VEDBWSBFHMUYOA-UHFFFAOYSA-N
Data  2 IC50
  Tab Delimited (TSV)   2D SDfile   Computed 3D by Vconf -m prep SDfile
Find this compound or compounds like it in BindingDB:
Activity Spreadsheet -- Enzyme Inhibition Constant Data from BindingDB
Found 2 hits for monomerid = 50424995
Target72 kDa type IV collagenase(Homo sapiens (Human))
Trinity College
Curated by ChEMBL
LigandPNGBDBM50424995(CHEMBL2311772)
Affinity DataIC50:  21nM. Assay description: Inhibition of human recombinant MMP-2 after 45 mins by fluorogenic assay
In DepthDetails ArticlePubMed
TargetMatrix metalloproteinase-9(Homo sapiens (Human))
Trinity College
Curated by ChEMBL
LigandPNGBDBM50424995(CHEMBL2311772)
Affinity DataIC50:  13nM. Assay description: Inhibition of human recombinant MMP-9 after 45 mins by fluorogenic assay
In DepthDetails ArticlePubMed