BDBM50425199 CHEMBL2314260
SMILES CNC(=O)N=CCc1c(OC)ccc2ccc(OC)cc12
InChI Key InChIKey=ZYROOHNZDOGTOJ-UHFFFAOYSA-N
Data  2 KI
  Tab Delimited (TSV)   2D SDfile   Computed 3D by Vconf -m prep SDfile
Find this compound or compounds like it in BindingDB:
Activity Spreadsheet -- Enzyme Inhibition Constant Data from BindingDB
Found 2 hits for monomerid = 50425199
TargetMelatonin receptor type 1A(Homo sapiens (Human))
Paris-Sud University
Curated by ChEMBL
LigandPNGBDBM50425199(CHEMBL2314260)
Affinity DataKi:  0.200nM. Assay description: Displacement of [125I]2-iodomelatonin from human recombinant MT1 receptor expressed in HEK293 cells after 2 hrs by gamma counting
In DepthDetails ArticlePubMed
TargetMelatonin receptor type 1B(Homo sapiens (Human))
Paris-Sud University
Curated by ChEMBL
LigandPNGBDBM50425199(CHEMBL2314260)
Affinity DataKi:  0.300nM. Assay description: Displacement of [125I]2-iodomelatonin from human recombinant MT2 receptor expressed in HEK293 cells after 2 hrs by gamma counting
In DepthDetails ArticlePubMed