BDBM50425232 CHEMBL2314836
SMILES [#6]-[#6]-[#6@H](-[#6])-[#6@H](-[#7])-[#6](=O)-[#7]-[#6@@H](-[#6]-[#6](-[#7])=O)-[#6](=O)-[#7]-1-[#6]-[#6]-[#6]-[#6@H]-1-[#6](=O)-[#7]-[#6@@H](-[#6]-[#6]-[#6]-[#6]-[#7]-[#6](=O)-[#6]-[#7]-1-[#6]-[#6]-[#7](-[#6]-[#6](-[#8])=O)-[#6]-[#6]-[#7](-[#6]-[#6](-[#8])=O)-[#6]-[#6]-[#7](-[#6]-[#6](=O)-[#7]-[#6@@H](-[#6]-c2ccc(-[#8])cc2)-[#6](=O)-[#7]-[#6@@H](-[#6]-[#6]-[#6]-[#7]-[#6](-[#7])=[#7])-[#6](=O)-[#7]-[#6@@H](-[#6]-[#6](-[#6])-[#6])-[#6](=O)-[#7]-[#6@@H](-[#6]-[#6]-[#6]\[#7]=[#6](/[#7])-[#7])-[#6](=O)-[#7]-[#6@@H](-[#6]-c2ccc(-[#8])cc2)-[#6](-[#7])=O)-[#6]-[#6]-1)-[#6](-[#8])=O
InChI Key InChIKey=HTDZRANUJCRWEW-DWUUFFTHSA-N
Data  1 IC50
  Tab Delimited (TSV)   2D SDfile   Computed 3D by Vconf -m prep SDfile
Find this compound or compounds like it in BindingDB:
Activity Spreadsheet -- Enzyme Inhibition Constant Data from BindingDB
Found 1 hit for monomerid = 50425232
TargetNeuropeptide Y receptor type 1(Homo sapiens (Human))
The Ohio State University
Curated by ChEMBL
LigandPNGBDBM50425232(CHEMBL2314836)
Affinity DataIC50:  9.80nM. Assay description: Displacement of [125I]-NPY from Y1 receptor in human MCF7 cells in presence of 1 uM BBN
In DepthDetails ArticlePubMed