BDBM50425336 CHEMBL2315875
SMILES Clc1ccc2oc(NCCCC(=O)NC3CCCC3)nc2c1
InChI Key InChIKey=JMJNAGBLPSBNBK-UHFFFAOYSA-N
Data  1 IC50
  Tab Delimited (TSV)   2D SDfile   Computed 3D by Vconf -m prep SDfile
Find this compound or compounds like it in BindingDB:
Activity Spreadsheet -- Enzyme Inhibition Constant Data from BindingDB
Found 1 hit for monomerid = 50425336
TargetProstaglandin E synthase(Homo sapiens (Human))
Pfizer
Curated by ChEMBL
LigandPNGBDBM50425336(CHEMBL2315875)
Affinity DataIC50: >1.00E+4nM. Assay description: Inhibition of human recombinant mPGES-1 using PGH2 as substrate incubated 20 mins prior to substrate addition measured after 30 secs by EIA
In DepthDetails ArticlePubMed