BDBM50425394 CHEMBL2312274
SMILES Cc1cc(NC(=O)CC(O)=O)c2CCCc2c1Oc1ccc(O)c(CCc2cccc(O)c2)c1
InChI Key InChIKey=NYKQTFRSTRUJKK-UHFFFAOYSA-N
Data  2 KI
  Tab Delimited (TSV)   2D SDfile   Computed 3D by Vconf -m prep SDfile
Find this compound or compounds like it in BindingDB:
Activity Spreadsheet -- Enzyme Inhibition Constant Data from BindingDB
Found 2 hits for monomerid = 50425394
TargetThyroid hormone receptor beta(Homo sapiens (Human))
Kissei Pharmaceutical
Curated by ChEMBL
LigandPNGBDBM50425394(CHEMBL2312274)
Affinity DataKi:  81nM. Assay description: Displacement of [125I]-T3 from human TRbeta expressed in insect cells after 16 to 48 hrs by gamma-counting
In DepthDetails ArticlePubMed
TargetThyroid hormone receptor alpha(Homo sapiens (Human))
Kissei Pharmaceutical
Curated by ChEMBL
LigandPNGBDBM50425394(CHEMBL2312274)
Affinity DataKi: >1.00E+4nM. Assay description: Displacement of [125I]-T3 from human TRalpha expressed in insect cells after 16 to 48 hrs by gamma-counting
In DepthDetails ArticlePubMed