BDBM50425512 CHEMBL2313288
SMILES Cn1c(\C=C\c2ccccc2)nc2n(C)c(=O)ccc12
InChI Key InChIKey=SECOXYBIXVNDDY-CSKARUKUSA-N
Data  1 KI  1 IC50
  Tab Delimited (TSV)   2D SDfile   Computed 3D by Vconf -m prep SDfile
Find this compound or compounds like it in BindingDB:
Activity Spreadsheet -- Enzyme Inhibition Constant Data from BindingDB
Found 2 hits for monomerid = 50425512
TargetAdenosine receptor A2a(Homo sapiens (Human))
Universit£
Curated by ChEMBL
LigandPNGBDBM50425512(CHEMBL2313288)
Affinity DataKi: >1.00E+4nM. Assay description: Displacement of [3H]ZM241385 from human adenosine A2A receptor expressed in HEK293 cells after 1 hr by microbeta scintillation counting analysis
In DepthDetails ArticlePubMed
TargetAmine oxidase [flavin-containing] B(Homo sapiens (Human))
Universit£
Curated by ChEMBL
LigandPNGBDBM50425512(CHEMBL2313288)
Affinity DataIC50: >1.00E+4nM. Assay description: Inhibition of human MAOB after 1 hr by luminescence assay
In DepthDetails ArticlePubMed