BDBM50425782 CHEMBL2316580
SMILES CN1CCN(Cc2ccc(NC(=O)c3ccc(C)c(c3)C#Cc3cnc4n(C)ncc4c3)cc2C(F)(F)F)CC1
InChI Key InChIKey=UPKSXVLHHYRHGK-UHFFFAOYSA-N
Data  1 IC50
  Tab Delimited (TSV)   2D SDfile   Computed 3D by Vconf -m prep SDfile
Find this compound or compounds like it in BindingDB:
Activity Spreadsheet -- Enzyme Inhibition Constant Data from BindingDB
Found 1 hit for monomerid = 50425782
TargetTyrosine-protein kinase ABL1(Homo sapiens (Human))
Chinese Academy Of Sciences
Curated by ChEMBL
LigandPNGBDBM50425782(CHEMBL2316580)
Affinity DataIC50:  1.5nM. Assay description: Inhibition of human recombinant wild type ABL1 expressed in insect cells after 30 mins by FRET assay
In DepthDetails ArticlePubMed