BDBM50425980 CHEMBL2314705
SMILES Cc1cc2occ(C(=O)c3ccc(Cl)cc3)c2cc1O
InChI Key InChIKey=FGXNCKGGNGKVBT-UHFFFAOYSA-N
Data  1 IC50
  Tab Delimited (TSV)   2D SDfile   Computed 3D by Vconf -m prep SDfile
Find this compound or compounds like it in BindingDB:
Activity Spreadsheet -- Enzyme Inhibition Constant Data from BindingDB
Found 1 hit for monomerid = 50425980
TargetNAD-dependent protein deacetylase sirtuin-1(Homo sapiens (Human))
Chinese Academy Of Sciences
Curated by ChEMBL
LigandPNGBDBM50425980(CHEMBL2314705)
Affinity DataIC50:  8.80E+4nM. Assay description: Inhibition of N-terminal His6-tagged SIRT1 coding region (156-664) (unknown origin) expressed in Escherichia coli BL21(DE3) using 31.25 uM ac-RHKKac-...
In DepthDetails ArticlePubMed