BDBM50426008 CHEMBL2314937
SMILES [#7]-[#6@@H](-[#6]-[#6]-[#6]\[#7]=[#6](\[#7])-[#7])-[#6](=O)-[#7]-[#6]-[#6]-[#6]-[#6]-[#6]-[#7]-[#6]-[#6]-[#6]-[#6]-[#6]-[#6]-[#6]-[#7]-[#6](=O)-[#6@H](-[#6]-[#6](-[#7])=O)-[#7]-[#6](=O)-[#6]-c1ccc(-[#8])cc1-[#8]
InChI Key InChIKey=QUIDUYNONCGJJB-ZEQRLZLVSA-N
Data  2 IC50
  Tab Delimited (TSV)   2D SDfile   Computed 3D by Vconf -m prep SDfile
Find this compound or compounds like it in BindingDB:
Activity Spreadsheet -- Enzyme Inhibition Constant Data from BindingDB
Found 2 hits for monomerid = 50426008
TargetGlutamate receptor ionotropic, NMDA 1/2A(Rattus norvegicus (Rat))
University Of Copenhagen
Curated by ChEMBL
LigandPNGBDBM50426008(CHEMBL2314937)
Affinity DataIC50:  17nM. Assay description: Inhibition of rat GluN1/2A receptor expressed in Xenopus laevis oocyte assessed as glutamate and glycine-induced current at holding potentials from -...
In DepthDetails ArticlePubMed
TargetGlutamate receptor 1(Rattus norvegicus (Rat))
University Of Copenhagen
Curated by ChEMBL
LigandPNGBDBM50426008(CHEMBL2314937)
Affinity DataIC50:  118nM. Assay description: Inhibition of rat GluA1 receptor flip form expressed in Xenopus laevis oocyte assessed as glutamate-induced current at holding potentials from -80 to...
In DepthDetails ArticlePubMed