BDBM50426208 CHEMBL2311933
SMILES [O-][N+](=O)c1c(Nc2cc(F)cc(Cl)c2)ccc2nonc12
InChI Key InChIKey=CDQUJZKBRAFWNG-UHFFFAOYSA-N
Data  1 IC50  1 Kd
PDB links: 2 PDB IDs match this monomer.
  Tab Delimited (TSV)   2D SDfile   Computed 3D by Vconf -m prep SDfile
Find this compound or compounds like it in BindingDB:
Activity Spreadsheet -- Enzyme Inhibition Constant Data from BindingDB
Found 2 hits for monomerid = 50426208
TargetEndothelial PAS domain-containing protein 1(Homo sapiens (Human))
Peloton Therapeutics
Curated by ChEMBL
LigandPNGBDBM50426208(CHEMBL2311933)
Affinity DataIC50:  490nM. Assay description: Binding affinity to His-tagged HIF-2alpha PAS-B domain (unknown origin) after 2 hrs by scintillation proximity assay
TargetEndothelial PAS domain-containing protein 1(Homo sapiens (Human))
Peloton Therapeutics
Curated by ChEMBL
LigandPNGBDBM50426208(CHEMBL2311933)
Affinity DataKd:  90nM. Assay description: Binding affinity to wild type PAS-B domain of HIF-2alpha (unknown origin) by isothermal calorimetry analysis