BDBM50426297 CHEMBL2312680
SMILES N[C@@H](C[C@@H](CCC(=O)NNc1ccccc1)C(O)=O)C(O)=O
InChI Key InChIKey=VJGPPVUHQVJHJM-KOLCDFICSA-N
Data  4 KI
  Tab Delimited (TSV)   2D SDfile   Computed 3D by Vconf -m prep SDfile
Find this compound or compounds like it in BindingDB:
Activity Spreadsheet -- Enzyme Inhibition Constant Data from BindingDB
Found 4 hits for monomerid = 50426297
TargetGlutamate receptor ionotropic, kainate 1(RAT)
University Of Copenhagen
Curated by ChEMBL
LigandPNGBDBM50426297(CHEMBL2312680)
Affinity DataKi:  382nM. Assay description: Displacement of [3H]-(2S,4R)-4-methylglutamic acid from full length recombinant rat GluKK1(Q)1b receptor expressed in sf9 cells by liquid scintillati...
In DepthDetails ArticlePubMed
TargetGlutamate receptor ionotropic, kainate 3(Rattus norvegicus)
University Of Copenhagen
Curated by ChEMBL
LigandPNGBDBM50426297(CHEMBL2312680)
Affinity DataKi:  5.66E+3nM. Assay description: Displacement of [3H]-(2S,4R)-4-methylglutamic acid from full length recombinant rat GluK3 receptor expressed in sf9 cells by liquid scintillation cou...
In DepthDetails ArticlePubMed
TargetGlutamate receptor 2(Rattus norvegicus)
University Of Copenhagen
Curated by ChEMBL
LigandPNGBDBM50426297(CHEMBL2312680)
Affinity DataKi:  5.33E+4nM. Assay description: Displacement of [3H]AMPA from full length recombinant rat GluKA2(R) receptor expressed in sf9 cells by liquid scintillation counting
In DepthDetails ArticlePubMed
TargetGlutamate receptor ionotropic, kainate 2(Rattus norvegicus)
University Of Copenhagen
Curated by ChEMBL
LigandPNGBDBM50426297(CHEMBL2312680)
Affinity DataKi: >1.00E+5nM. Assay description: Displacement of [3H]-(2S,4R)-4-methylglutamic acid from full length recombinant rat GluKK2(VCR) receptor expressed in sf9 cells by liquid scintillati...
In DepthDetails ArticlePubMed